{"text_format":"3","workbook":"xlsx","n_sheets":13,"sheets":["Home","WAPS CALC","E8 E9 WAPS CALC","Medals","SSgt Cutoff","TSgt Cutoff","MSgt Cutoff","SMSgt Cutoff","CMSgt Cutoff","Reference Sheet","Promo Rates","Finance","Macros"],"not_rendered":{"charts":1,"images":137,"macros":1,"defined_names":96,"comments":2},"read":"whole","date_system":"1900"}

{"sheet":"Home","index":0,"n_rows":58,"n_cols":13,"rows_kept":58,"merged":[[1,6,3,11],[1,12,2,16],[3,12,3,16],[4,12,4,16],[5,12,5,16],[6,12,6,16],[7,12,7,16],[8,12,8,16],[9,12,9,16],[10,12,10,16],[11,12,11,16],[12,12,12,16],[13,12,13,16],[14,1,15,5],[15,12,15,16],[16,12,16,16],[17,2,17,4],[18,2,18,4],[19,2,19,4],[19,5,19,6],[19,11,19,12],[20,2,20,4],[20,5,20,6],[21,2,21,4],[21,5,21,6],[23,2,23,8],[25,2,25,8],[27,2,27,6],[27,7,27,8],[28,2,28,6],[28,7,28,8],[29,2,29,6],[29,7,29,8],[30,2,30,6],[30,7,30,8],[31,2,31,6],[31,7,31,8],[32,2,32,6],[32,7,32,8],[33,2,33,6],[33,7,33,8],[34,2,34,6],[34,7,34,8],[35,2,35,6],[35,7,35,8],[36,2,36,6],[36,7,36,8],[37,2,37,6],[37,7,37,8],[39,1,40,6],[39,11,40,16],[40,8,40,9],[41,1,47,6],[41,7,46,10],[41,11,49,16],[50,11,50,16]]}
[]
[{"$nulls":12},"Useful Air Force Links"]
[]
[{"$nulls":12},"Scott Career Assistance Advisor (Secure Website)"]
[{"$nulls":12},"Airman Promotion Program"]
[{"$nulls":12},"www.usmilitary.about.com"]
[{"$nulls":12},"www.gruntsmilitary.com"]
[{"$nulls":12},"www.chairforce.com"]
[{"$nulls":12},"EPR Bullet Tracker"]
[{"$nulls":12},"www.afmentor.com"]
[{"$nulls":12},"www.afforums.com"]
[{"$nulls":12},"Fitness Calculator"]
[{"$nulls":12},"www.stanish.net"]
[{"$nulls":12},"www.dfas.mil/"]
[]
{"$rows_left_out":34}
{"sheet":"WAPS CALC","index":1,"n_rows":5049,"n_cols":30,"rows_kept":5049,"merged":[[1,3,3,3],[4,6,4,10],[5,3,5,12],[6,3,6,12],[7,3,7,12],[7,17,7,18],[9,4,9,6],[9,10,9,11],[9,17,9,18],[10,4,10,6],[10,10,10,11],[11,4,11,6],[11,10,11,11],[12,4,12,6],[12,10,12,11],[12,17,13,17],[12,18,13,18],[13,4,13,6],[13,10,13,11],[14,3,14,6],[14,10,14,12],[15,4,15,6],[15,10,15,11],[16,4,16,6],[16,10,16,11],[17,10,17,11],[18,6,20,6],[18,10,18,11],[18,16,19,16],[18,17,19,17],[18,18,19,18],[18,19,19,19],[21,7,21,8],[21,10,22,12],[23,10,23,11],[23,17,23,18],[24,10,24,11],[25,10,25,11],[26,10,26,11],[27,10,27,11],[27,16,36,19],[28,10,28,11],[29,10,29,11],[30,10,30,11],[31,10,31,11],[32,10,32,11],[33,7,34,7],[33,8,34,8],[33,10,33,11],[34,3,34,4],[36,3,36,12],[43,1,43,14],[45,1,45,14],[46,1,48,14],[50,1,50,14],[74,3,74,12],[99,21,99,23],[99,24,99,26],[99,27,99,29],[5006,4,5006,5],[5007,4,5007,5],[5008,4,5008,6],[5009,4,5009,6]]}
[]
[]
[]
[]
[]
[{"$nulls":3},{"$f":"IF(E12=\"\",\"\",\"You have been in the Air Force for \"&DATEDIF(E12,E5009,\"y\")&\" years, \"&DATEDIF(E12,E5009,\"ym\")&\" months, \"&DATEDIF(E12,E5009,\"md\")&\" days\"&\"\")","v":""}]
[{"$nulls":3},{"$f":"IF(E13=\"\",\"\",\"You have been a \"&E5010&\" for \"&DATEDIF(E13,E5009,\"y\")&\" years, \"&DATEDIF(E13,E5009,\"ym\")&\" months, \"&DATEDIF(E13,E5009,\"md\")&\" days\"&\"\")","v":""}]
[{"$nulls":17},"Compare yourslef to last years averages"]
[]
[{"$nulls":3},"Select rank your testing for",{"$nulls":6},"TAFMS Points",null,{"$f":"IF(I5007>40,40,I5007)","v":0},{"$nulls":3},"# Tested",{"$f":"IF(AND($E$10=\"ssgt\",$E$11=2009),V102,IF(AND($E$10=\"tsgt\",$E$11=2009),Y102,IF(AND($E$10=\"msgt\",$E$11=2009),AB102,\"\")))","v":""}]
[{"$nulls":3},"What year will you test in?",{"$nulls":6},"TIG Points",null,{"$f":"IF(I5008>60,60,I5008)","v":0},{"$nulls":3},"Promoted",{"$f":"IF(AND($E$10=\"ssgt\",$E$11=2009),X102,IF(AND($E$10=\"tsgt\",$E$11=2009),AA102,IF(AND($E$10=\"msgt\",$E$11=2009),AD102,\"\")))","v":""},{"$f":"R11/R10","v":{"$error":"#VALUE!"}}]
[{"$nulls":3},"What is your TAFMS?",{"$nulls":6},"EPR Points",null,{"$f":"I34","v":""},{"$nulls":3},"Not Promoted",{"$f":"IF(AND($E$10=\"ssgt\",$E$11=2009),W102,IF(AND($E$10=\"tsgt\",$E$11=2009),Z102,IF(AND($E$10=\"msgt\",$E$11=2009),AC102,\"\")))","v":""},{"$f":"R12/R10","v":{"$error":"#VALUE!"}}]
[{"$nulls":3},"What is your TIG?",{"$nulls":6},"Medals Points",null,{"$f":"F35","v":0},{"$nulls":4},"You","2008 Selects"]
[{"$nulls":3},"What is your est. cutoff score?",{"$nulls":6},"Total Points Earned",null,{"$f":"IF(ISNA(SUM(M10:M13)),\"\",SUM(M10:M13))","v":0}]
[{"$nulls":3},"See 2008 Cut Off Scores",{"$nulls":6},{"$f":"IF(ISNA(VLOOKUP(M16,quotetable,2,TRUE)),\"\",VLOOKUP(M16,quotetable,2,TRUE))","v":""},{"$nulls":5},"Years TIG",{"$f":"DATEDIF(E13,T15,\"m\")/12","v":{"v":0,"d":"0.00"}},{"$f":"IF(AND($E$10=\"ssgt\",$E$11=2009),X104,IF(AND($E$10=\"tsgt\",$E$11=2009),AA104,IF(AND($E$10=\"msgt\",$E$11=2009),AD104,\"\")))","v":""},{"$f":"IF(AND(E10=\"ssgt\",E11=2009),VLOOKUP(E11,e5cycle,13,FALSE),IF(AND(E10=\"TSGT\",E11=2009),VLOOKUP(E11,E6Cycle,13,FALSE),IF(AND(E10=\"MSGT\",E11=2009),VLOOKUP(E11,E7Cycle,13,FALSE))))","v":false}]
{"$rows_left_out":90}
{"sheet":"E8 E9 WAPS CALC","index":2,"n_rows":5049,"n_cols":26,"rows_kept":5049,"merged":[[4,6,4,10],[5,3,5,12],[6,3,6,12],[7,3,7,12],[7,17,7,18],[9,4,9,6],[9,10,9,12],[9,17,9,18],[10,4,10,6],[10,10,10,11],[11,4,11,6],[11,10,11,11],[12,4,12,6],[12,10,12,11],[12,17,13,17],[12,18,13,18],[13,4,13,6],[13,10,13,11],[14,3,14,6],[14,10,14,11],[15,4,15,6],[15,10,15,12],[16,4,16,6],[16,10,16,11],[17,10,17,11],[18,6,20,6],[18,10,18,11],[18,19,19,19],[19,10,19,11],[20,10,20,11],[21,7,21,8],[21,10,21,11],[22,10,22,11],[22,17,22,18],[23,10,23,12],[24,10,24,11],[25,10,25,11],[26,10,26,11],[26,16,33,19],[27,10,27,11],[28,10,28,11],[29,10,29,11],[30,10,30,11],[31,10,31,11],[32,10,32,11],[33,7,34,7],[33,8,34,8],[33,10,33,11],[34,3,34,4],[34,10,34,11],[50,14,50,16],[61,4,61,5],[62,4,62,5],[63,4,63,5],[99,20,99,22],[99,23,99,25]]}
[]
[]
[]
[]
[]
[{"$nulls":3},{"$f":"IF(E12=\"\",\"\",\"You have been in the Air Force for \"&DATEDIF(E12,E5009,\"y\")&\" years, \"&DATEDIF(E12,E5009,\"ym\")&\" months, \"&DATEDIF(E12,E5009,\"md\")&\" days\"&\"\")","v":""}]
[{"$nulls":3},{"$f":"IF(E13=\"\",\"\",\"You have been a \"&E5010&\" for \"&DATEDIF(E13,E5009,\"y\")&\" years, \"&DATEDIF(E13,E5009,\"ym\")&\" months, \"&DATEDIF(E13,E5009,\"md\")&\" days\"&\"\")","v":""}]
[{"$nulls":17},"Compare yourslef to last years averages"]
[]
[{"$nulls":3},"Select rank your testing for","SMSgt",{"$nulls":5},"Board Score Estimator",{"$nulls":5},"# Tested",{"$f":"IF(AND($E$10=\"smsgt\",$E$11=2009),U102,IF(AND($E$10=\"cmsgt\",$E$11=2009),X102,\"\"))","v":14404}]
[{"$nulls":3},"What year will you test in?",2009,{"$nulls":5},"        Board Member #",null,"Select Score",{"$nulls":3},"Promoted",{"$f":"IF(AND($E$10=\"smsgt\",$E$11=2009),W102,IF(AND($E$10=\"cmsgt\",$E$11=2009),Z102,\"\"))","v":1284},{"$f":"R11/R10","v":{"v":0.08914190502638156,"d":"8.91%"}}]
[{"$nulls":3},"What is your TAFMS?",{"$nulls":6},1,null,null,{"v":10,"d":"10.00"},null,null,"Not Promoted",{"$f":"IF(AND($E$10=\"smsgt\",$E$11=2009),V102,IF(AND($E$10=\"cmsgt\",$E$11=2009),Y102,\"\"))","v":13120},{"$f":"R12/R10","v":{"v":0.9108580949736185,"d":"91.09%"}}]
[{"$nulls":3},"What is your TIG?",{"$nulls":6},2,null,null,10,{"$nulls":3},"You","2008 Selects"]
[{"$nulls":3},"What is your est. cutoff score?",{"$nulls":6},3,null,null,{"v":10,"d":"10.00"}]
[{"$nulls":3},"See 2008 Cut Off Scores",{"$nulls":6},"Composite:",null,{"$f":"SUM(M12*15)+(M13*15)+(M14*15)","v":{"v":0,"d":"0.0"}},{"$nulls":3},"Years TIG",{"$f":"DATEDIF(E13,T15,\"m\")/12","v":{"v":109.83333333333333,"d":"109.83"}},{"$f":"IF(AND($E$10=\"smsgt\",$E$11=2009),W104,IF(AND($E$10=\"cmsgt\",$E$11=2009),Z104,\"\"))","v":4.54},{"$f":"IF(AND($E$10=\"smsgt\",$E$11=2009),VLOOKUP($E$11,E8Cycle,13,FALSE),IF(AND($E$10=\"cmsgt\",$E$11=2009),VLOOKUP($E$11,E9Cycle,13,FALSE),\"\"))","v":"2009-11-01"}]
{"$rows_left_out":109}
{"sheet":"Medals","index":3,"n_rows":110,"n_cols":8,"rows_kept":110,"merged":[[1,1,2,4],[3,1,3,4],[5,3,5,4],[14,10,15,12]]}
[]
[null,"Check mark each medal you have and your total points will display below.  For additional devices, select how many you have from the drop down boxes.  Click each ribbon/medal to view more information about eligibility and descriptions."]
[]
[]
[{"$nulls":4},{"$f":"\"You have \"&SUM(G9:G28) &\" medal points\"","v":"You have 0 medal points"}]
[{"$nulls":3},{"$f":"IF(H100>25,\"You have maxed out your WAPS medal points\",\"\")","v":""}]
[{"$nulls":3},"Devices","Name of Medal/Ribbon"]
[]
[{"$nulls":4},{"$f":"IF(F9=TRUE,\"You Wish!\",\"Air Force Medal of Honor\")","v":"Air Force Medal of Honor"},false,{"$f":"IF(ISERROR(IF(F9=TRUE,15,\"\")*H9),\"\",IF(F9=TRUE,15,\"\")*H9)","v":""},1]
[{"$nulls":4},"Air Force Cross",false,{"$f":"IF(ISERROR(IF(F10=TRUE,11,\"\")*H10),\"\",IF(F10=TRUE,11,\"\")*H10)","v":""},1]
[{"$nulls":4},"Defense Distinguished Service Medal",false,{"$f":"IF(ISERROR(IF(F11=TRUE,9,\"\")*H11),\"\",IF(F11=TRUE,9,\"\")*H11)","v":""},1]
[{"$nulls":4},"Air Force Distinguished Service Medal",false,{"$f":"IF(ISERROR(IF(F12=TRUE,9,\"\")*H12),\"\",IF(F12=TRUE,9,\"\")*H12)","v":""},1]
[{"$nulls":4},"Silver Star",false,{"$f":"IF(ISERROR(IF(F13=TRUE,9,\"\")*H13),\"\",IF(F13=TRUE,9,\"\")*H13)","v":""},1]
[{"$nulls":4},"Defense Superior Service Medal",false,{"$f":"IF(ISERROR(IF(F14=TRUE,7,\"\")*H14),\"\",IF(F14=TRUE,7,\"\")*H14)","v":""},1]
[{"$nulls":4},"Legion of Merit",false,{"$f":"IF(ISERROR(IF(F15=TRUE,7,\"\")*H15),\"\",IF(F15=TRUE,7,\"\")*H15)","v":""},1]
{"$rows_left_out":96}
{"sheet":"SSgt Cutoff","index":4,"n_rows":149,"n_cols":5,"rows_kept":149,"merged":[[0,0,0,4]]}
[]
["PROM","NBR","NBR2","PROM3","PROM4"]
["AFSC","ELIG","SEL","OPP","CUTOFF"]
["00XXX",318,138,{"v":43.4,"d":"43.40"},268.74]
["00XXXX",56,29,51.79,271.79]
["1A0X1",93,40,43.01,284.01]
["1A1X1",22,10,45.45,274.69]
["1A2X1",228,116,50.88,268.47]
["1A3X1",192,83,43.23,263.14]
["1A4X1",103,53,51.46,259.19]
["1A6X1",1,1,{"v":100,"d":"100.00"},286.86]
["1A7X1",27,14,51.85,272.75]
["1A8X1",220,113,51.36,251.06]
["1C0X2",140,61,43.57,{"v":269.2,"d":"269.20"}]
["1C1X1",399,200,50.13,258.73]
{"$rows_left_out":135}
{"sheet":"TSgt Cutoff","index":5,"n_rows":164,"n_cols":5,"rows_kept":164,"merged":[[0,0,0,4]]}
[]
["PROM","NBR","NBR2","PROM3","PROM4"]
["AFSC","ELIG","SEL","OPP","CUTOFF"]
["00XXX",1910,355,18.59,316.36]
["00XXXX",379,83,{"v":21.9,"d":"21.90"},315.81]
["1A0X1",90,20,22.22,320.32]
["1A1X1",189,35,18.52,333.59]
["1A2X1",260,49,18.85,337.56]
["1A3X1",187,41,21.93,319.74]
["1A4X1",91,20,21.98,311.55]
["1A6X1",40,7,{"v":17.5,"d":"17.50"},319.89]
["1A7X1",48,9,18.75,339.32]
["1A8X1",98,22,22.45,315.17]
["1C0X2",254,45,17.72,305.15]
["1C1X1",377,70,18.57,302.75]
{"$rows_left_out":150}
{"sheet":"MSgt Cutoff","index":6,"n_rows":163,"n_cols":5,"rows_kept":163,"merged":[[0,0,0,4]]}
[]
["PROM","NBR","NBR2","PROM3","PROM4"]
["AFSC","ELIG","SEL","OPP","CUTOFF"]
["00XXX",454,102,22.47,334.16]
["00XXXX",162,43,26.54,339.44]
["1A0X1",62,14,22.58,346.89]
["1A1X1",298,65,21.81,344.04]
["1A2X1",234,52,22.22,353.71]
["1A3X1",132,29,21.97,334.42]
["1A4X1",66,15,22.73,{"v":342.4,"d":"342.40"}]
["1A6X1",38,8,21.05,{"v":342.5,"d":"342.50"}]
["1A7X1",35,8,22.86,345.68]
["1A8X1",71,19,26.76,331.35]
["1C0X2",162,36,22.22,327.75]
["1C1X1",198,44,22.22,328.68]
{"$rows_left_out":149}
{"sheet":"SMSgt Cutoff","index":7,"n_rows":119,"n_cols":5,"rows_kept":119,"merged":[[0,0,0,4]]}
[]
["PROM","NBR","NBR2","PROM3","PROM4"]
["AFSC","ELIG","SEL","OPP","CUTOFF"]
["1A0X1",61,6,9.84,665.95]
["1A1X1",235,17,7.23,662.66]
["1A2X1",175,19,10.86,663.43]
["1A3X1",92,9,9.78,657.44]
["1A4X1",59,5,8.33,656.24]
["1A6X1",27,2,7.41,672.06]
["1A7X1",36,4,11.11,685.47]
["1A8X1",50,5,{"v":10,"d":"10.00"},648.48]
["1C0X2",96,9,9.27,658.84]
["1C1X1",111,12,10.81,643.36]
["1C2X1",21,3,14.29,666.37]
["1C3X1",150,15,{"v":10,"d":"10.00"},{"v":649.5,"d":"649.50"}]
{"$rows_left_out":105}
{"sheet":"CMSgt Cutoff","index":8,"n_rows":90,"n_cols":5,"rows_kept":90,"merged":[[0,0,0,4]]}
[]
["PROM","NBR","NBR","PROM","PROM"]
["AFSC","ELIG","SEL","OPP","CUTOFF"]
["1A0X0","16","3","18.75","646.83"]
["1A1X0","38","8","21.05","645.66"]
["1A2X0","31","7","22.58","646.83"]
["1A3X0","11","2","18.18","688.66"]
["1A4X0","7","1","14.29","672.16"]
["1A6X0","3","1","33.33","594.00"]
["1A7X0","4","1","25.00","636.50"]
["1A8X0","10","2","20.00","641.25"]
["1C0X0","20","4","20.00","646.58"]
["1C1X0","20","4","20.00","624.58"]
["1C2X0","3","2","66.67","649.16"]
["1C3X0","23","5","21.74","647.08"]
{"$rows_left_out":76}
{"sheet":"Reference Sheet","index":9,"n_rows":75,"n_cols":36,"rows_kept":75,"hidden":true,"merged":[[0,3,0,5],[0,7,0,9],[0,10,0,12],[0,13,0,15],[0,16,0,18],[2,22,14,22],[14,7,15,18],[15,22,27,22],[17,5,21,11],[28,22,40,22],[41,22,53,22],[54,22,66,22]]}
["TAFMS","TIG",{"$nulls":5},"SSgt",null,null,"TSgt/MSgt",null,null,"E8",null,null,"E9"]
[{"$f":"TODAY()","v":"2008-11-21"},{"$f":"TODAY()","v":"2008-11-21"},{"$nulls":6},"2009-08-01","2009-08-31",null,"2009-07-01","2009-07-31",2008,"2009-03-01","2009-03-31",2008,"2009-12-01","2009-12-31",{"$nulls":5},"Cycle","DOR","TIG Required","TAFMSD","TIS Required","PAFSC","PECD","Testing Cycle","Promotion Months","Announcements","EPRs Consdrd","1st Test date"]
[{"$f":"(YEAR('Reference Sheet'!A2)-YEAR(#REF!))*12+MONTH('Reference Sheet'!A2)-MONTH(#REF!)","v":{"$error":"#REF!"}},{"$f":"(YEAR(B2)-YEAR(#REF!))*12+MONTH(B2)-MONTH(#REF!)","v":{"$error":"#REF!"}},{"$nulls":5},2009,"2010-08-01","2010-08-31",2009,"2010-07-01","2010-07-31",2009,"2010-03-01","2010-03-31",2009,"2010-12-01","2010-12-31",1,null,null,"E7Cycle",2008,"08E7","2006-07-01","24 Months","2001-07-01","8 Years","7 Skill Level","2007-12-31","1 Feb - 31 Mar 08","Aug 08 - Jul 09","2008-06-08","Jan 03 - Dec 07","2008-02-01"]
[{"$f":"(A3)*(1/6)","v":{"$error":"#REF!"}},{"$f":"(B3)*(1/2)","v":{"$error":"#REF!"}},{"$nulls":5},2010,"2011-08-01","2011-08-31",2010,"2011-07-01","2011-07-31",2010,"2011-03-01","2011-03-31",2010,"2011-12-01","2011-12-31",2,2008,null,null,2009,"09E7","2007-07-01","24 Months","2002-07-01","8 Years","7 Skill Level","2008-12-31","1 Feb - 31 Mar 09","Aug 09 - Jul 10","2009-06-09","Jan 04 - Dec 08","2009-02-01"]
[{"$nulls":7},2011,"2012-08-01","2012-08-31",2011,"2012-07-01","2012-07-31",2011,"2012-03-01","2012-03-31",2011,"2012-12-01","2012-12-31",3,2009,null,null,2010,"10E7","2008-07-01","24 Months","2003-07-01","8 Years","7 Skill Level","2009-12-31","1 Feb - 31 Mar 10","Aug 10 - Jul 11","2010-06-10","Jan 05 - Dec 09","2010-02-01"]
[{"$nulls":7},2012,"2013-08-01","2013-08-31",2012,"2013-07-01","2013-07-31",2012,"2013-03-01","2013-03-31",2012,"2013-12-01","2013-12-31",4,2010,null,null,2011,"11E7","2009-07-01","24 Months","2004-07-01","8 Years","7 Skill Level","2010-12-31","1 Feb - 31 Mar 11","Aug 11 - Jul 12","2011-06-11","Jan 06 - Dec 10","2011-02-01"]
[{"$nulls":7},2013,"2014-08-01","2014-08-31",2013,"2014-07-01","2014-07-31",2013,"2014-03-01","2014-03-31",2013,"2014-12-01","2014-12-31",5,2011,null,null,2012,"12E7","2010-07-01","24 Months","2005-07-01","8 Years","7 Skill Level","2011-12-31","1 Feb - 31 Mar 12","Aug 12 - Jul 13","2012-06-11","Jan 07 - Dec 11","2012-02-01"]
[{"$nulls":7},2014,"2015-08-01","2015-08-31",2014,"2015-07-01","2015-07-31",2014,"2015-03-01","2015-03-31",2014,"2015-12-01","2015-12-31",6,2012,null,null,2013,"13E7","2011-07-01","24 Months","2006-07-01","8 Years","7 Skill Level","2012-12-31","1 Feb - 31 Mar 13","Aug 13 - Jul 14","2013-06-12","Jan 08 - Dec 12","2013-02-01"]
[{"$nulls":7},2015,"2016-08-01","2016-08-31",2015,"2016-07-01","2016-07-31",2015,"2016-03-01","2016-03-31",2015,"2016-12-01","2016-12-31",7,2013,null,null,2014,"14E7","2012-07-01","24 Months","2007-07-01","8 Years","7 Skill Level","2013-12-31","1 Feb - 31 Mar 14","Aug 14 - Jul 15","2014-06-13","Jan 09 - Dec 13","2014-02-01"]
[{"$nulls":7},2016,"2017-08-01","2017-08-31",2016,"2017-07-01","2017-07-31",2016,"2017-03-01","2017-03-31",2016,"2017-12-01","2017-12-31",8,2014,null,null,2015,"15E7","2013-07-01","24 Months","2008-07-01","8 Years","7 Skill Level","2014-12-31","1 Feb - 31 Mar 15","Aug 15 - Jul 16","2015-06-14","Jan 10 - Dec 14","2015-02-01"]
[{"$nulls":7},2017,"2018-08-01","2018-08-31",2017,"2018-07-01","2018-07-31",2017,"2018-03-01","2018-03-31",2017,"2018-12-01","2018-12-31",9,2015,null,null,2016,"16E7","2014-07-01","24 Months","2009-07-01","8 Years","7 Skill Level","2015-12-31","1 Feb - 31 Mar 16","Aug 16 - Jul 17","2016-06-14","Jan 11 - Dec 15","2016-02-01"]
["Decorations",{"$nulls":6},2018,"2019-08-01","2019-08-31",2018,"2019-07-01","2019-07-31",2018,"2019-03-01","2019-03-31",2018,"2019-12-01","2019-12-31",10,2016,null,null,2017,"17E7","2015-07-01","24 Months","2010-07-01","8 Years","7 Skill Level","2016-12-31","1 Feb - 31 Mar 17","Aug 17 - Jul 18","2017-06-15","Jan 12 - Dec 16","2017-02-01"]
[1,"AF Achievement",1,null,"Ranks",null,null,2019,"2020-08-01","2020-08-31",2019,"2020-07-01","2020-07-31",2019,"2020-03-01","2020-03-31",2019,"2020-12-01","2020-12-31",11,2017,null,null,2018,"18E7","2016-07-01","24 Months","2011-07-01","8 Years","7 Skill Level","2017-12-31","1 Feb - 31 Mar 18","Aug 18 - Jul 19","2018-06-16","Jan 13 - Dec 17","2018-02-01"]
[2,"Army Achievement",1,1,{"$nulls":3},2020,"2021-08-01","2021-08-31",2020,"2021-07-01","2021-07-31",2020,"2021-03-01","2021-03-31",2020,"2021-12-01","2021-12-31",12,2018,null,null,2019,"19E7","2017-07-01","24 Months","2012-07-01","8 Years","7 Skill Level","2018-12-31","1 Feb - 31 Mar 19","Aug 19 - Jul 20","2019-06-17","Jan 14 - Dec 18","2019-02-01"]
[3,"Coast Guard Achievement",1,2,"SSgt",null,null,"1st and last day of the promotion cycles",{"$nulls":11},13,2019,null,null,2020,"20E7","2018-07-01","24 Months","2013-07-01","8 Years","7 Skill Level","2019-12-31","1 Feb - 31 Mar 20","Aug 20 - Jul 21","2020-06-17","Jan 15 - Dec 19","2020-02-01"]
{"$rows_left_out":61}
{"sheet":"Promo Rates","index":10,"n_rows":111,"n_cols":35,"rows_kept":111,"merged":[[1,5,3,14],[40,3,42,14],[48,0,48,3],[48,5,48,8],[48,10,48,13],[48,15,48,18],[48,20,48,23]]}
[]
[{"$nulls":5},{"$f":"\"\"&AA56&\" Yearly Promotion Rates\"","v":"MSgt Yearly Promotion Rates"}]
{"$rows_empty":38}
[{"$nulls":3},{"$f":"IF(AA55=1,\"WAPS testing was completed twice a year up to 1992 & again in 1995, the bar graph shows the average between the two.\",\"\")","v":""}]
{"$rows_empty":7}
["SSgt/E-5",{"$nulls":4},"TSgt/E-6",{"$nulls":4},"MSgt/E-7",{"$nulls":4},"SMSgt/E-8",{"$nulls":4},"CMSgt/E-9",{"$nulls":4},1,"E-5 Promotion Averages","SSgt",null,"E-5","E-6","E-7","E-8","E-9",{"$f":"OFFSET(AC49,0,$AA$55)","v":"E-7"}]
["CYCLE","CONSIDERED","SELECTED","%",null,"CYCLE","CONSIDERED","SELECTED","%",null,"CYCLE","CONSIDERED","SELECTED","%",null,"CYCLE","CONSIDERED","SELECTED","%",null,"CYCLE","CONSIDERED","SELECTED","%",null,2,"E-6 Promotion Averages","TSgt",1980,17.49,21.28,35.92,23.08,31.72,{"$f":"OFFSET(AC50,0,$AA$55)/100","v":{"v":0.3592,"d":"35.9%"}}]
["71A5",94882,17084,18.01,null,"71A6",89185,9391,10.53,null,"71A7",58114,6151,10.58,null,"71S8",27294,1339,4.91,null,"71S9",10695,687,6.42,null,3,"E-7 Promotion Averages","MSgt",1981,21.04,21.43,38.18,24.19,33.85,{"$f":"OFFSET(AC51,0,$AA$55)/100","v":{"v":0.3818,"d":"38.2%"}}]
["71B5",113001,33804,29.91,null,"71B6",96220,5079,5.28,null,"71B7",61197,3763,6.15,null,"72S8",30559,3401,11.13,null,"72S9",11824,1524,12.89,null,4,"E-8 Promotion Averages","SMSgt",1982,15.41,21.11,33.94,24.43,43.56,{"v":0.3394,"d":"33.9%"}]
["72A5",92430,21334,23.08,null,"72A6",94012,15057,16.02,null,"72A7",58712,8946,15.24,null,"73S8",30133,4818,15.99,null,"73S9",8975,1735,19.33,null,5,"E-9 Promotion Averages","CMSgt",1983,15,20.58,32.51,16.89,30.94,{"v":0.3251,"d":"32.5%"}]
["72B5",93975,20765,22.1,null,"72B6",84671,5262,6.21,null,"72B7",51516,1610,3.13,null,"74S8",30891,1793,5.8,null,"74S9",8238,664,8.06,{"$nulls":4},1984,14.85,15.49,28.25,15.35,17.79,{"v":0.2825,"d":"28.3%"}]
["73A5",94212,16210,17.21,null,"73A6",86991,8079,9.29,null,"73A7",52515,4862,"9,26",null,"75S8",28703,4350,15.16,null,"75S9",8338,1487,17.83,null,null,3,null,1985,15.3,18.12,29.28,12.8,22.64,{"v":0.2928,"d":"29.3%"}]
["73B5",82226,12982,15.79,null,"73B6",85152,3757,4.41,null,"74A7",56442,4276,7.58,null,"76S8",25909,3747,14.46,null,"76S9",6356,1218,19.16,null,null,{"$f":"VLOOKUP(AA55,Z49:AB53,3)","v":"MSgt"},null,1986,16.04,19.06,30.92,17.48,23.82,{"v":0.30920000000000003,"d":"30.9%"}]
["74A5",77986,7199,9.23,null,"74A6",88659,7064,7.97,null,"74B7",51729,4313,8.34,null,"77S8",24183,1899,7.85,null,"77S9",7027,833,11.85,{"$nulls":4},1987,14.6,19.19,32.2,15.2,19.3,{"v":0.322,"d":"32.2%"}]
["74B5",89020,15181,17.05,null,"74B6",87807,6883,7.84,null,"75A7",50516,4338,8.59,null,"78S8",20612,2808,13.62,null,"78S9",5733,1238,21.59,{"$nulls":4},1988,8.68,11.12,22.15,9.1,12.58,{"v":0.22149999999999997,"d":"22.2%"}]
{"$rows_left_out":54}
{"sheet":"Finance","index":11,"n_rows":190,"n_cols":21,"rows_kept":190,"merged":[[1,4,4,14],[4,2,4,3],[6,6,6,7],[6,8,6,9],[6,11,8,15],[7,1,9,1],[7,2,9,2],[8,6,8,7],[8,8,8,9],[9,11,9,12],[9,14,9,15],[10,11,10,12],[10,14,10,15],[11,6,11,7],[11,8,11,9],[11,11,11,12],[11,14,11,15],[14,6,14,7],[14,8,14,9],[14,11,14,12],[14,14,14,15],[16,6,16,7],[16,8,16,9],[16,11,16,15],[17,11,18,15],[18,6,18,7],[18,8,18,9],[19,11,20,11],[19,12,20,12],[19,13,20,13],[19,14,20,14],[19,15,20,15],[20,6,20,7],[20,8,20,9],[21,8,21,9],[22,6,22,7],[22,8,22,9],[25,1,26,1],[26,6,26,7],[26,8,26,9],[31,3,31,5],[31,6,31,7],[31,8,31,9],[32,3,32,9],[33,11,34,15],[34,3,34,7],[38,51,39,72],[40,51,40,72],[55,50,55,72],[56,51,56,72],[63,50,63,72],[64,51,64,72],[75,50,75,72],[164,15,164,16]]}
[]
[{"$nulls":4},"Calculate your pay!"]
[]
[]
[]
[]
[{"$nulls":6},"Monthly",null,"Annual",null,null,"Difference you will get paid if promoted"]
[null,"Basic Pay",null,{"$f":"VLOOKUP(C164,B136:C163,2)","v":0},{"$f":"VLOOKUP(H164,G166:H188,2)","v":0}]
[{"$nulls":6},{"$f":"IF(ISNA(INDEX(RANGE,MATCH(D8,INDEX(RANGE,,1),0),MATCH(E8,INDEX(RANGE,1,),0))),\"\",INDEX(RANGE,MATCH(D8,INDEX(RANGE,,1),0),MATCH(E8,INDEX(RANGE,1,),0)))","v":""},null,{"$f":"IF(ISERROR(G9*12),\"\",(G9*12))","v":""}]
[{"$nulls":11},"From:",null,null,"To:"]
[{"$nulls":11},{"$f":"VLOOKUP(K181,B136:C163,2)","v":0},null,null,{"$f":"VLOOKUP(K183,B136:C163,2)","v":0}]
[null,"Fly Pay",{"$nulls":4},{"$f":"IF(E165=1,\"\",VLOOKUP(E165,C166:E190,3))","v":""},null,{"$f":"IF(ISERROR(G12*12),\"\",(G12*12))","v":""},null,null,{"$f":"VLOOKUP(K182,G166:H188,2)","v":0},null,null,{"$f":"VLOOKUP(K184,G166:H188,2)","v":0}]
[]
[]
[null,"BAS",{"$nulls":4},{"$f":"IF(AND(K175=TRUE,L175=1),L176,IF(AND(K175=TRUE,L175=2),L177,\"\"))","v":""},null,{"$f":"IF(ISERROR(G15*12),\"\",(G15*12))","v":""},null,null,{"$f":"IF(ISNA(INDEX(RANGE,MATCH(L11,INDEX(RANGE,,1),0),MATCH(L12,INDEX(RANGE,1,),0))),\"\",INDEX(RANGE,MATCH(L11,INDEX(RANGE,,1),0),MATCH(L12,INDEX(RANGE,1,),0)))","v":""},null,null,{"$f":"IF(ISNA(INDEX(RANGE,MATCH(O11,INDEX(RANGE,,1),0),MATCH(O12,INDEX(RANGE,1,),0))),\"\",INDEX(RANGE,MATCH(O11,INDEX(RANGE,,1),0),MATCH(O12,INDEX(RANGE,1,),0)))","v":""}]
{"$rows_left_out":77}
{"sheet":"Macros","index":12,"n_rows":94,"n_cols":12,"rows_kept":94,"merged":[[4,2,8,9],[4,11,5,15],[12,2,23,9],[27,2,31,9],[54,2,56,9],[80,1,80,5],[80,6,80,9],[82,1,86,7],[94,1,94,3]]}
[]
[]
[]
[null,"What are Macros?"]
[null,null,"Macros in a nutshell is Visual Basic code an author creates to trigger specific events that are not included in Excel's standard functions.  For example, to utilize the clear and start over macro I had to write the code for this because Excel does not have a built in feature on the ribbon to clear specific cells that I specify.",{"$nulls":8},"Example of a Compile Error"]
[]
[]
[]
[]
[]
[null,"What are the disadvantages to using Macros?"]
[]
[null,null,"The author could write bad code and a message compile error could display.  This is a result of misspelling code, not knowing how to write code correctly, or writing code to trigger events not related to the specific event.  If you ever are confronted with this error, the best course of action is to write down the error, close the worksheet and contact the author with the error so he/she can fix it.\n\nA few people will warn you not to use Macros from untrusted publishers because they think we will write code to crash your machine.  If the author of a spreadsheet is leaving his/her contact info, chances are they have not written code to do so.  Plus, it would be stupid of me to write bad code and pass it out to the entire Air Force to see!"]
{"$rows_empty":12}
[null,"How to enable Macros"]
{"$rows_left_out":21}